Home > Failed To > Vmware Failed To Execute The Build Command

Vmware Failed To Execute The Build Command

Contents

Is there any way to take stable Long exposure photos without using Tripod? To get ubuntu 15.04 and workstation 11.1.0 (and probably older) working just follow these instructions: wiki.archlinux.org/index.php/VMware#3.19_kernels_and_up –Rqomey Apr 29 '15 at 8:44 "probably older" - does not work, I Kids shuffling cards Install Homebrew package with all available options how to remove this battery tray bolt and what is it? Thx for the post.Worked fine on Linux Mint 17.1 (Rebecca) with VMware Workstation 9.0.4 build-1945795Linux 3.13.0-37-generic #64-Ubuntu SMP x86_64 x86_64 x86_64 GNU/LinuxReplyDeleteAnonymousApril 2, 2015 at 10:11 PMDid not worked on kali Check This Out

Re: Workstation 11 can not be installed under Ubuntu 15.04 RJHsiao May 12, 2015 3:47 AM (in response to simmogs) simmogs 撰写: I tried to use this solution with Workstation Here is the post I made to vmware workstation forums. Adv Reply Page 1 of 4 123 ... Here's the original (filename spelt wrong): http://imgur.com/qgyfpWCDeleteDan Dar3September 29, 2015 at 2:06 PMI see.

Vmware Failed To Execute The Build Command

Prove that the normalizer of the subgroup is the subgroup is itself "How are you spending your time on the computer?" Kids shuffling cards Are people of Nordic Nations "happier, healthier" But now now i get this dialogue box saying GNU gcc 5.1 version not found. Here is the log: 2015-05-05T09:09:07.484+01:00| vthread-4| I120: Log for VMware Workstation pid=7438 version=11.0.0 build=build-2305329 option=Release 2015-05-05T09:09:07.484+01:00| vthread-4| I120: The process is 64-bit. 2015-05-05T09:09:07.484+01:00| vthread-4| I120: Host codepage=UTF-8 encoding=UTF-8 2015-05-05T09:09:07.484+01:00| vthread-4| I120:

After installation when i ran it, it tries to install something and generates an error message asking to look in the log. more stack exchange communities company blog Stack Exchange Inbox Reputation and Badges sign up log in tour help Tour Start here for a quick overview of the site Help Center Detailed Makefile:1384: recipe for target '_module_/tmp/modconfig-CGoVbZ/vmnet-only' failed make[1]: *** [_module_/tmp/modconfig-CGoVbZ/vmnet-only] Error 2 make[1]: Leaving directory '/usr/lib/modules/4.4.1-2-ARCH/build' Makefile:120: recipe for target 'vmnet.ko' failed make: *** [vmnet.ko] Error 2 make: Leaving directory '/tmp/modconfig-CGoVbZ/vmnet-only' Unable Failed To Build Vmnet. Failed To Execute The Build Command. Fedora SUBDIRS=$PWD SRCROOT=$PWD/. \
MODULEBUILDDIR= modules
make[1]: Entering directory `/usr/src/kernels/4.5.0-1.el7.elrepo.x86_64'
CC [M] /tmp/modconfig-WvsfOC/vmmon-only/linux/driver.o
CC [M] /tmp/modconfig-WvsfOC/vmmon-only/linux/hostif.o
CC [M] /tmp/modconfig-WvsfOC/vmmon-only/linux/driverLog.o
CC [M] /tmp/modconfig-WvsfOC/vmmon-only/common/memtrack.o
CC [M] /tmp/modconfig-WvsfOC/vmmon-only/common/apic.o

What is the name of these creatures in Harry Potter and the Deathly Hallows? Failed To Build Vmmon. The solution is based on Garrett Skjelstad's "VMware modules & kernel 3.13" blog post. $ sudo lsb_release -a No LSB modules are available. But that is ok. 2014-02-03T16:32:01.553+08:00| vthread-3| I120: Using user supplied compiler "/usr/bin/gcc". 2014-02-03T16:32:01.562+08:00| vthread-3| I120: Got gcc version "4.8". 2014-02-03T16:32:01.563+08:00| vthread-3| I120: GCC minor version 4 does not match Kernel GCC http://askubuntu.com/questions/618503/unable-to-run-vmware-workstation-11-failed-to-build-vmnet Use LANG=C –A.B.

MODPOST 1 modules CC /tmp/modconfig-CGoVbZ/vmmon-only/vmmon.mod.o LD [M] /tmp/modconfig-CGoVbZ/vmmon-only/vmmon.ko make[1]: Leaving directory '/usr/lib/modules/4.4.1-2-ARCH/build' /sbin/make -C $PWD SRCROOT=$PWD/. \ MODULEBUILDDIR= postbuild make[1]: Entering directory '/tmp/modconfig-CGoVbZ/vmmon-only' make[1]: 'postbuild' is up to date. Vthread-3| W110: Failed To Build Vmnet. Failed To Execute The Build Command simmogs already said that before... I just ran vmware to finish the build. –phyatt Oct 3 '14 at 17:10 This one worked flawlessly for me. Failed to parse options.

Failed To Build Vmmon.

Yet, I'm using this Player 4.0.2., downloaded from VMware: VMware-Player-4.0.2-591240.x86_64.bundle Any thoughts? thanks so much for this.ReplyDeleteEtevavoc KaswiFebruary 28, 2015 at 3:27 PMwhere is the patch,where is vmnet,where is the filter.c.diff file????? Vmware Failed To Execute The Build Command Is there anything you can suggest to get this working with Workstation 10? Failed To Build Vmnet Centos 6 Windows 7 beta build 7057 on ASUS R2H Warning: You should consider making a note / saving the BCD settings with EasyBCD or similar before installing this build, as it lost

thanks a lot.ReplyDeleteAnonymousAugust 21, 2014 at 11:49 AMThanks a lot, saved my day.ReplyDeleteAnonymousAugust 27, 2014 at 1:37 PMNew to linux, but worked like a charm.ReplyDeleteВап КапSeptember 13, 2014 at 2:11 AMThanks his comment is here See the GNU General Public License * for more details. * * You should have received a copy of the GNU General Public License along * with this program; if not, Whoohoo! 2015-04-25T19:52:34.997+03:00| vthread-4| I120: Using temp dir "/tmp". 2015-04-25T19:52:34.997+03:00| vthread-4| I120: Obtaining info using the running kernel. 2015-04-25T19:52:34.998+03:00| vthread-4| I120: Setting header path for 3.19.0-15-generic to "/lib/modules/3.19.0-15-generic/build/include". 2015-04-25T19:52:34.998+03:00| vthread-4| I120: Validating Please download the x86 bundle.bundle in am using is/VMware-Workstation-Full-11.0.0-2305329.x86_64.bundle Like Show 0 Likes (0) Actions 14. Failed To Build Vmnet. Failed To Execute The Build Command. Centos 6

See log for details. –Safouen May 5 '15 at 10:11 Run gcc --version or which gcc –A.B. This is my error: make[1]: *** [_module_/tmp/vmware-root/modules/vmnet-only] Error 2 make[1]: Leaving directory /usr/src/linux-headers-3.13.0-37-generic' make: *** [vmnet.ko] Error 2 make: Leaving directory /tmp/vmware-root/modules/vmnet-only' Unable to install vmnet –hsnm Oct 15 '14 at So did you tried the solution from the link I past before? http://itivityglobal.com/failed-to/failed-to-execute-command-line-perl-perltidy.html Ubuntu Ubuntu Insights Planet Ubuntu Activity Page Please read before SSO login Advanced Search Forum The Ubuntu Forum Community Ubuntu Specialised Support Virtualisation [SOLVED] Virtual Network Device unable to load/compile-VM Player

Vielen Dank!DeleteReplyJeremy EllingtonJune 9, 2015 at 10:29 PMThanks so much! Vmnet Patch I'm runningDistributor ID: UbuntuDescription: Ubuntu 14.04.1 LTSRelease: 14.04Codename: trustyany one else run accross this?ReplyDeleteRepliesDan Dar3June 26, 2016 at 10:08 AMHi Jeff, see the updated post with a direct link to the before running vmware several modules should be compiled on kernelDeleteDan Dar3February 29, 2016 at 2:48 PMWhat I think the error message is trying to tell you is that your Linux kernel

Thanks. –kadaj Sep 21 '14 at 1:33 Thanks for fixing the typos! –phyatt Oct 3 '14 at 17:09 This still doesn't work for me on ubuntu 14.04

Hot Network Questions Is an animated corpse with a weapon overpowered? Failed to execute the build Command up vote 0 down vote favorite Failed to install VMware player in my Ubuntu 14.04 OS installed on an external hard drive. Just wanted to double-check it was not an issue with mismatching -devel.Looks like this is a known problem? Failed To Build Vmnet. Failed To Execute The Build Command Arch Linux Browse other questions tagged 13.10 64-bit vmware or ask your own question.

Is the binomial theorem actually more efficient than just distributing Equivalent form of Black-Scholes Equation (to transform to heat equation) TeXForm handling of derivative higher than two Install Homebrew package with Reboot and try to launch vmware again, this should solve it. You don't even have to wait for installer to finish, just copy the file somewhere else and abort. http://itivityglobal.com/failed-to/failed-to-execute-command-usr-openv-netbackup-bin-bptm.html share|improve this answer edited Sep 4 '14 at 21:45 RobotHumans 19.6k25189 answered Apr 7 '14 at 8:01 nonsleepr 47144 5 The patch listed in askubuntu.com/questions/414783/…, with the updates for typos,

Or it's merely an ordinary mistake? apt-get remove 3.13.0-43-generic Also removed the updated linux-headers. You can not post a blank message. For details and our forum data attribution, retention and privacy policy, see here CentOS The Community ENTerprise Operating System Skip to content Search Advanced search Quick links Unanswered posts Active

The "<" means out, ">" means in.ReplyDeleteRepliesAnonymousJuly 17, 2014 at 8:38 PMThanks! more hot questions question feed about us tour help blog chat data legal privacy policy work here advertising info mobile contact us feedback Technology Life / Arts Culture / Recreation Science Apex schedulable jobs Using Flexbox, have elements stretch to fill gap between rows Sort an array of integers into odd, then even ​P​i​ =​= ​3​.​2​ Where can I report criminal intent The error message: patch-modules_3.2.0.sh: 27: [: player4.0.2: unexpected operator patch-modules_3.2.0.sh: 28: [: player4.0.2: unexpected operator Sorry, this script is only for VMWare WorkStation 8.0.2 or VMWare Player 4.0.2.

Like Show 0 Likes (0) Actions 3. But could you explain this more? May 5 '15 at 10:25 it works perfectly thank you –Safouen May 5 '15 at 10:31 | show 6 more comments Your Answer draft saved draft discarded Sign share|improve this answer answered Dec 20 '14 at 9:03 Mohan Sukumar 1 add a comment| up vote 0 down vote Another solution is replacing /usr/lib/vmware/modules/source/vmnet.tar with working one taken from VMware-Player-7.1.bundle.

Encryption - How to claim authorship anonymously? Is there anything you can suggest to get this working with Workstation 10? Distributor ID: Ubuntu Description: Ubuntu Trusty Tahr (development branch) Release: 14.04 Codename: trusty $ uname -a Linux VOSTRO 3.13.0-4-generic #19-Ubuntu SMP Thu Jan 16 18:10:11 UTC 2014 x86_64 x86_64 x86_64 GNU/Linux Whoohoo! 2015-04-25T19:52:34.484+03:00| vthread-4| I120: found symbol version file /lib/modules/3.19.0-15-generic/build/Module.symvers 2015-04-25T19:52:34.484+03:00| vthread-4| I120: Reading symbol versions from /lib/modules/3.19.0-15-generic/build/Module.symvers. 2015-04-25T19:52:34.500+03:00| vthread-4| I120: Read 18818 symbol versions 2015-04-25T19:52:34.500+03:00| vthread-4| I120: Reading in info for

http://www.youtube.com/playlist?list=PLKPi39tTpkdpjBVQZo5oFLWjFjlOMkd2AReplyDeleteAnonymousMay 2, 2014 at 2:23 PMthank you so much workstation 10 now works on ubuntu 14.04ReplyDeleteTodd WaddellMay 3, 2014 at 3:50 AMWorked for me with Ubuntu 14.04 and workstation 10.Thanks!!ReplyDeletexortMay 9, Thanks for posting this.ReplyDeleteAnonymousApril 9, 2014 at 4:49 PMHelo, I have the same problem :(Everting run okey, but when I run the patch command, that's return an error:[email protected]:/usr/lib/vmware/modules/source# patch vmnet-only/filter.c < Module is currently at "/tmp/modconfig-kcZFf6/vmmon.o". 2015-04-25T19:52:37.171+03:00| vthread-4| I120: Found the vmmon symvers file at "/tmp/modconfig-kcZFf6/vmmon-only/Module.symvers". 2015-04-25T19:52:37.171+03:00| vthread-4| I120: Installing vmmon from /tmp/modconfig-kcZFf6/vmmon.o to /lib/modules/3.19.0-15-generic/misc/vmmon.ko. 2015-04-25T19:52:37.171+03:00| vthread-4| I120: Registering file "/lib/modules/3.19.0-15-generic/misc/vmmon.ko". 2015-04-25T19:52:37.553+03:00|